BDBM50427117 CHEMBL2322892
SMILES Cc1c(Cl)c(nn1CC(=O)N1CCN(CC1)c1ccc(C)cc1)C(F)(F)F
InChI Key InChIKey=GPHYWGCAVGTJJE-UHFFFAOYSA-N
Data  1 IC50
  Tab Delimited (TSV)   2D SDfile   Computed 3D by Vconf -m prep SDfile
Find this compound or compounds like it in BindingDB:
Activity Spreadsheet -- Enzyme Inhibition Constant Data from BindingDB
Found 1 hit for monomerid = 50427117
TargetC-C chemokine receptor type 1(Homo sapiens (Human))
Chemocentryx
Curated by ChEMBL
LigandPNGBDBM50427117(CHEMBL2322892)
Affinity DataIC50:  3.65E+3nM. Assay description: Displacement of [125I]-CCL3/MIP-1alpha from CCR1 in human THP1 cells
In DepthDetails ArticlePubMed