BDBM50427142 CHEMBL2324129
SMILES Cn1cc(cn1)-c1cnc2ccc3ccc(CC(N)=O)cc3c(=O)c2c1
InChI Key InChIKey=UAYZHKCXTSZNKM-UHFFFAOYSA-N
Data  2 IC50
  Tab Delimited (TSV)   2D SDfile   Computed 3D by Vconf -m prep SDfile
Find this compound or compounds like it in BindingDB:
Activity Spreadsheet -- Enzyme Inhibition Constant Data from BindingDB
Found 2 hits for monomerid = 50427142
TargetHepatocyte growth factor receptor(Homo sapiens (Human))
Merck
Curated by ChEMBL
LigandPNGBDBM50427142(CHEMBL2324129)
Affinity DataIC50:  60nM. Assay description: Inhibition of c-MET (unknown origin)-catalyzed N-biotinylated EQEDEPEGDYFEWLECONH2 phosphorylation by TR-FRET assay
In DepthDetails ArticlePubMed
TargetMacrophage-stimulating protein receptor(Homo sapiens (Human))
Merck
Curated by ChEMBL
LigandPNGBDBM50427142(CHEMBL2324129)
Affinity DataIC50:  861nM. Assay description: Inhibition of RON (unknown origin) by TR-FRET assay
In DepthDetails ArticlePubMed