BDBM50427204 CHEMBL2324856
SMILES CCCc1sc(cc1CC)C(O)=O
InChI Key InChIKey=QIFYZRSSOKPILW-UHFFFAOYSA-N
Data  4 IC50
  Tab Delimited (TSV)   2D SDfile   Computed 3D by Vconf -m prep SDfile
Find this compound or compounds like it in BindingDB:
Activity Spreadsheet -- Enzyme Inhibition Constant Data from BindingDB
Found 4 hits for monomerid = 50427204
TargetD-aspartate oxidase(Homo sapiens (Human))
Kitasato University
Curated by ChEMBL
LigandPNGBDBM50427204(CHEMBL2324856)
Affinity DataIC50: >1.00E+7nM. Assay description: Inhibition of human recombinant N-terminal His-tagged DDO expressed in Escherichia coli BL21(DE3) using D-aspartate as substrate by colorimetric assa...
In DepthDetails ArticlePubMed
TargetSerine racemase(Homo sapiens (Human))
Kitasato University
Curated by ChEMBL
LigandPNGBDBM50427204(CHEMBL2324856)
Affinity DataIC50: >1.00E+7nM. Assay description: Inhibition of human recombinant N-terminal His-tagged serine racemase expressed in Escherichia coli BL21(DE3) using L-serine as substrate after 10 mi...
In DepthDetails ArticlePubMed
TargetD-amino-acid oxidase(Homo sapiens (Human))
Kitasato University
Curated by ChEMBL
LigandPNGBDBM50427204(CHEMBL2324856)
Affinity DataIC50:  7.91E+6nM. Assay description: Inhibition of human recombinant N-terminal His-tagged DAO expressed in Escherichia coli BL21(DE3) using D-serine as substrate by colorimetric assay
In DepthDetails ArticlePubMed
TargetD-amino-acid oxidase(Homo sapiens (Human))
Kitasato University
Curated by ChEMBL
LigandPNGBDBM50427204(CHEMBL2324856)
Affinity DataIC50: >1.00E+7nM. Assay description: Inhibition of human recombinant N-terminal His-tagged DAO expressed in Escherichia coli BL21(DE3) using D-alanine as substrate by colorimetric assay
In DepthDetails ArticlePubMed