BDBM50427356 CHEMBL2325733::US10654855, Example 57::US11236095, Example 57::US9492453, 57
SMILES NC1(CCN(CC1)c1ncnc2[nH]ccc12)C(=O)NC(CS(N)(=O)=O)c1ccc(Cl)cc1
InChI Key InChIKey=IWLDWBJBHVPZRX-UHFFFAOYSA-N
Data  6 IC50
  Tab Delimited (TSV)   2D SDfile   Computed 3D by Vconf -m prep SDfile
Find this compound or compounds like it in BindingDB:
Activity Spreadsheet -- Enzyme Inhibition Constant Data from BindingDB
Found 6 hits for monomerid = 50427356
TargetRAC-alpha serine/threonine-protein kinase(Homo sapiens (Human))
Astrazeneca
US Patent
LigandPNGBDBM50427356(CHEMBL2325733 | US10654855, Example 57 | US1123609...)
Affinity DataIC50:  12nMpH: 7.5 T: 2°C. Assay description: This assay detects inhibitors of AKT1 (PKBα) kinase activity using Caliper LabChip LC3000. The Caliper off-chip incubation mobility shift assay...
In DepthDetails US Patent
TargetRAC-alpha serine/threonine-protein kinase(Homo sapiens (Human))
Astrazeneca
US Patent
LigandPNGBDBM50427356(CHEMBL2325733 | US10654855, Example 57 | US1123609...)
Affinity DataIC50:  12nM. Assay description: Inhibition of recombinant Akt1 (unknown origin) using 5-FAM-labeled peptide as substrate after 1 hr by caliper off-chip incubation mobility shift ass...
In DepthDetails ArticlePubMed
TargetRAC-alpha serine/threonine-protein kinase(Homo sapiens (Human))
Astrazeneca
US Patent
LigandPNGBDBM50427356(CHEMBL2325733 | US10654855, Example 57 | US1123609...)
Affinity DataIC50:  12nM. Assay description: Following addition of compound or control to the assay plate, 6p1 peptide mix containing 3 μM substrate (5-FAM-GRPRTSSFAEG-CONH2; CRB) and 40 &#...
In DepthDetails US Patent
TargetPotassium voltage-gated channel subfamily H member 2(Homo sapiens (Human))
Astrazeneca
Curated by ChEMBL
LigandPNGBDBM50427356(CHEMBL2325733 | US10654855, Example 57 | US1123609...)
Affinity DataIC50: >3.33E+4nM. Assay description: Inhibition of human ERG expressed in CHO cells by ionworks assay
In DepthDetails ArticlePubMed
TargetRAC-alpha serine/threonine-protein kinase(Homo sapiens (Human))
Astrazeneca
US Patent
LigandPNGBDBM50427356(CHEMBL2325733 | US10654855, Example 57 | US1123609...)
Affinity DataIC50:  12nM. Assay description: For Echo dosing the solvent was 100% DMSO. A master plate was prepared with 40 ul of 10 mM stock from our Primary Liquid Store in quadrant 1 of a Lab...
In DepthDetails US Patent
TargetRho-associated protein kinase 2(Homo sapiens (Human))
Astrazeneca
Curated by ChEMBL
LigandPNGBDBM50427356(CHEMBL2325733 | US10654855, Example 57 | US1123609...)
Affinity DataIC50:  37nM. Assay description: Inhibition of recombinant ROCK2 (unknown origin) using 5-FAM-labeled peptide as substrate after 1 hr by caliper off-chip incubation mobility shift as...
In DepthDetails ArticlePubMed