BDBM50427551 CHEMBL1499599
SMILES Cc1nnc2ccc(nn12)N1CCCC1
InChI Key InChIKey=ODRDNKHQIVRNRC-UHFFFAOYSA-N
Data  1 Kd
  Tab Delimited (TSV)   2D SDfile   Computed 3D by Vconf -m prep SDfile
Find this compound or compounds like it in BindingDB:
Activity Spreadsheet -- Enzyme Inhibition Constant Data from BindingDB
Found 1 hit for monomerid = 50427551
TargetSteroid Delta-isomerase(Pseudomonas putida)
The University Of Tokyo
Curated by ChEMBL
LigandPNGBDBM50427551(CHEMBL1499599)
Affinity DataKd:  2.20E+4nM. Assay description: Binding affinity to Pseudomonas putida KSI by isothermal titration calorimetry
In DepthDetails ArticlePubMed