BDBM50427832 CHEMBL2326041
SMILES CN(C)CC[C@H](CSc1ccccc1)Nc1ccc(cc1[N+]([O-])=O)S(=O)(=O)Nc1ccc(cc1)N1CCN(CC1)c1cccc(c1)-c1c(C(=O)N[C@H]2C[C@@](C)(O)C2)c(C)n(C)c1-c1ccc(Cl)cc1
InChI Key InChIKey=MIOKLFHSILIHBT-IGNRCVAYSA-N
Data  2 IC50
  Tab Delimited (TSV)   2D SDfile   Computed 3D by Vconf -m prep SDfile
Find this compound or compounds like it in BindingDB:
Activity Spreadsheet -- Enzyme Inhibition Constant Data from BindingDB
Found 2 hits for monomerid = 50427832
TargetApoptosis regulator Bcl-2(Homo sapiens (Human))
University Of Michigan
Curated by ChEMBL
LigandPNGBDBM50427832(CHEMBL2326041)
Affinity DataIC50:  7.5nM. Assay description: Binding affinity to BCL2 (unknown origin) after 2 hrs by fluorescence polarization assay
In DepthDetails ArticlePubMed
TargetBcl-2-like protein 1(Homo sapiens (Human))
University Of Michigan
Curated by ChEMBL
LigandPNGBDBM50427832(CHEMBL2326041)
Affinity DataIC50:  15nM. Assay description: Binding affinity to BCL-XL (unknown origin) after 2 hrs by fluorescence polarization assay
In DepthDetails ArticlePubMed