BDBM50427845 CHEMBL2326353
SMILES COc1cc(OS(O)(=O)=O)cc2oc(-c3ccc(OS(O)(=O)=O)c(OCc4cn(CCCCn5c(nc6ccccc6c5=O)-c5cc(OC(C)=O)cc(OS(O)(=O)=O)c5)nn4)c3)c(OS(O)(=O)=O)c(=O)c12
InChI Key InChIKey=OVNIYBGLDUVHIQ-UHFFFAOYSA-N
Data  1 IC50
  Tab Delimited (TSV)   2D SDfile   Computed 3D by Vconf -m prep SDfile
Find this compound or compounds like it in BindingDB:
Activity Spreadsheet -- Enzyme Inhibition Constant Data from BindingDB
Found 1 hit for monomerid = 50427845
TargetCoagulation factor XI(Homo sapiens (Human))
Virginia Commonwealth University
Curated by ChEMBL
LigandPNGBDBM50427845(CHEMBL2326353)
Affinity DataIC50:  4.07E+5nM. Assay description: Inhibition of human factor 11a using S2366 as substrate after 10 mins by spectrophotometry
In DepthDetails ArticlePubMed