BDBM50427864 CHEMBL2326359
SMILES Cc1cc(N)nc(CCc2ccc(CCCN)c(CCc3cc(C)cc(N)n3)c2)c1
InChI Key InChIKey=KSYDDSWEHNSQGZ-UHFFFAOYSA-N
Data  3 KI  1 Kd
PDB links: 2 PDB IDs match this monomer.
  Tab Delimited (TSV)   2D SDfile   Computed 3D by Vconf -m prep SDfile
Find this compound or compounds like it in BindingDB:
Activity Spreadsheet -- Enzyme Inhibition Constant Data from BindingDB
Found 4 hits for monomerid = 50427864
TargetNitric oxide synthase, brain(Rattus norvegicus (rat))
Northwestern University
Curated by ChEMBL
LigandPNGBDBM50427864(CHEMBL2326359)
Affinity DataKi:  110nM. Assay description: Inhibition of rat recombinant nNOS expressed in Escherichia coli using L-arginine as substrate
TargetNitric oxide synthase, inducible(Mus musculus (mouse))
Northwestern University
Curated by ChEMBL
LigandPNGBDBM50427864(CHEMBL2326359)
Affinity DataKi:  2.19E+4nM. Assay description: Inhibition of mouse recombinant iNOS expressed in Escherichia coli using L-arginine as substrate
In DepthDetails ArticlePubMed
TargetNitric oxide synthase, endothelial(Bos taurus (bovine))
Northwestern University
Curated by ChEMBL
LigandPNGBDBM50427864(CHEMBL2326359)
Affinity DataKi:  3.34E+4nM. Assay description: Inhibition of bovine recombinant eNOS expressed in Escherichia coli using L-arginine as substrate
In DepthDetails ArticlePubMed
TargetNitric oxide synthase oxygenase(Bacillus subtilis (Firmicutes))
University Of California Irvine
LigandPNGBDBM50427864(CHEMBL2326359)
Affinity DataKd:  8.61E+3nM. Assay description: In short, the difference between the imidazole-bound low-spin peak at 430 nm and the inhibitorbound high-spin peak at 395 nm was measured as a functi...