BDBM50427908 CHEMBL2326098
SMILES COC[C@H]1CCCN1CC[C@](N)(CCCCB(O)O)C(O)=O
InChI Key InChIKey=XJYPAZFFTBQGGV-TZMCWYRMSA-N
Data  2 IC50
  Tab Delimited (TSV)   2D SDfile   Computed 3D by Vconf -m prep SDfile
Find this compound or compounds like it in BindingDB:
Activity Spreadsheet -- Enzyme Inhibition Constant Data from BindingDB
Found 2 hits for monomerid = 50427908
TargetArginase-2, mitochondrial(Homo sapiens (Human))
Institutes For Pharmaceutical Discovery
Curated by ChEMBL
LigandPNGBDBM50427908(CHEMBL2326098)
Affinity DataIC50:  1.71E+3nM. Assay description: Inhibition of human recombinant fully active truncated form of arginase 2 overexpressed in Escherichia coli BL21(DE3) assessed as inhibition of urea ...
In DepthDetails ArticlePubMed
TargetArginase-1(Homo sapiens (Human))
Institutes For Pharmaceutical Discovery
Curated by ChEMBL
LigandPNGBDBM50427908(CHEMBL2326098)
Affinity DataIC50:  1.75E+3nM. Assay description: Inhibition of human recombinant full length arginase I overexpressed in Escherichia coli BL21(DE3) assessed as inhibition of urea formation after 60 ...
In DepthDetails ArticlePubMed