BDBM50428004 CHEMBL2322624
SMILES O=C(CSc1nc2CCSc2c(=O)n1-c1ccccc1)Nc1ccc(cn1)-c1ccoc1
InChI Key InChIKey=PJRBBQYCEYMVCL-UHFFFAOYSA-N
Data  1 EC50
  Tab Delimited (TSV)   2D SDfile   Computed 3D by Vconf -m prep SDfile
Find this compound or compounds like it in BindingDB:
Activity Spreadsheet -- Enzyme Inhibition Constant Data from BindingDB
Found 1 hit for monomerid = 50428004
TargetProtein-serine O-palmitoleoyltransferase porcupine(Mus musculus)
The University Of Texas Southwestern Medical Center
Curated by ChEMBL
LigandPNGBDBM50428004(CHEMBL2322624)
Affinity DataEC50:  1.5nM. Assay description: Inhibition of porcupine-mediated Wnt signalling in mouse L cells after 24 hrs by SpringerImages-Topflash reporter assay
In DepthDetails ArticlePubMed