BDBM50428019 CHEMBL2323240
SMILES CCOc1ccc(NC(=O)CSc2nc3CCSc3c(=O)n2-c2ccccc2)cc1
InChI Key InChIKey=PJPALZRVAGSBAL-UHFFFAOYSA-N
Data  1 EC50
  Tab Delimited (TSV)   2D SDfile   Computed 3D by Vconf -m prep SDfile
Find this compound or compounds like it in BindingDB:
Activity Spreadsheet -- Enzyme Inhibition Constant Data from BindingDB
Found 1 hit for monomerid = 50428019
TargetProtein-serine O-palmitoleoyltransferase porcupine(Mus musculus)
The University Of Texas Southwestern Medical Center
Curated by ChEMBL
LigandPNGBDBM50428019(CHEMBL2323240)
Affinity DataEC50:  1.00E+3nM. Assay description: Inhibition of porcupine-mediated Wnt signalling in mouse L cells after 24 hrs by SpringerImages-Topflash reporter assay
In DepthDetails ArticlePubMed