BDBM50428049 CHEMBL2324268
SMILES O=C(CNC(=O)c1nn(-c2ccccc2)c(=O)c2ccccc12)Nc1nc2ccccc2s1
InChI Key InChIKey=ONPBXCZWSZUVLX-UHFFFAOYSA-N
Data  1 EC50
  Tab Delimited (TSV)   2D SDfile   Computed 3D by Vconf -m prep SDfile
Find this compound or compounds like it in BindingDB:
Activity Spreadsheet -- Enzyme Inhibition Constant Data from BindingDB
Found 1 hit for monomerid = 50428049
TargetProtein-serine O-palmitoleoyltransferase porcupine(Mus musculus)
The University Of Texas Southwestern Medical Center
Curated by ChEMBL
LigandPNGBDBM50428049(CHEMBL2324268)
Affinity DataEC50:  2.60E+3nM. Assay description: Inhibition of porcupine-mediated Wnt signalling in mouse L cells after 24 hrs by SpringerImages-Topflash reporter assay
In DepthDetails ArticlePubMed