BDBM50428589 CHEMBL2337970
SMILES CCc1cc2c(ccc(OC)n2n1)-c1ccc(=O)n(CCCCOc2ccc(cc2)C2=NNC(=O)CC2C)n1
InChI Key InChIKey=JQUAECMVMLCYEG-UHFFFAOYSA-N
Data  2 IC50
  Tab Delimited (TSV)   2D SDfile   Computed 3D by Vconf -m prep SDfile
Find this compound or compounds like it in BindingDB:
Activity Spreadsheet -- Enzyme Inhibition Constant Data from BindingDB
Found 2 hits for monomerid = 50428589
TargetcGMP-inhibited 3',5'-cyclic phosphodiesterase 3A(Homo sapiens (Human))
Kyorin Pharmaceutical
Curated by ChEMBL
LigandPNGBDBM50428589(CHEMBL2337970)
Affinity DataIC50:  2.70nM. Assay description: Inhibition of PDE3A (unknown origin) by radiochemical assay
In DepthDetails ArticlePubMed
TargetcAMP-specific 3',5'-cyclic phosphodiesterase 4B(Homo sapiens (Human))
Kyorin Pharmaceutical
Curated by ChEMBL
LigandPNGBDBM50428589(CHEMBL2337970)
Affinity DataIC50:  20nM. Assay description: Inhibition of PDE4B (unknown origin) by radiochemical assay
In DepthDetails ArticlePubMed