BDBM50428730 CHEMBL2333146
SMILES CCCNC(=O)CC#N
InChI Key InChIKey=QXWFLDZVDBAJAG-UHFFFAOYSA-N
Data  1 Kd
  Tab Delimited (TSV)   2D SDfile   Computed 3D by Vconf -m prep SDfile
Find this compound or compounds like it in BindingDB:
Activity Spreadsheet -- Enzyme Inhibition Constant Data from BindingDB
Found 1 hit for monomerid = 50428730
TargetInduced myeloid leukemia cell differentiation protein Mcl-1(Homo sapiens (Human))
Dalian University Of Technology
Curated by ChEMBL
LigandPNGBDBM50428730(CHEMBL2333146)
Affinity DataKd:  4.28E+3nM. Assay description: Binding affinity to his-tagged Mcl-1 (unknown origin) expressed in Escherichia coli BL21 (DE3) cells by ITC analysis
In DepthDetails ArticlePubMed