BDBM50428845 CHEMBL1594453
SMILES COc1ccccc1\C=C(/C#N)C(=O)Nc1ccc(cc1)S(N)(=O)=O
InChI Key InChIKey=YGKQNEHQVHKXLF-JLHYYAGUSA-N
Data  4 KI
  Tab Delimited (TSV)   2D SDfile   Computed 3D by Vconf -m prep SDfile
Find this compound or compounds like it in BindingDB:
Activity Spreadsheet -- Enzyme Inhibition Constant Data from BindingDB
Found 4 hits for monomerid = 50428845
TargetCarbonic anhydrase 12(Homo sapiens (Human))
Salman Bin Abdulaziz University
Curated by ChEMBL
LigandPNGBDBM50428845(CHEMBL1594453)
Affinity DataKi:  0.600nM. Assay description: Inhibition of human carbonic anhydrase 12 preincubated for 15 mins by CO2 hydration stopped-flow assay
In DepthDetails ArticlePubMed
TargetCarbonic anhydrase 2(Homo sapiens (Human))
Salman Bin Abdulaziz University
Curated by ChEMBL
LigandPNGBDBM50428845(CHEMBL1594453)
Affinity DataKi:  6.90nM. Assay description: Inhibition of human carbonic anhydrase 2 preincubated for 15 mins by CO2 hydration stopped-flow assay
In DepthDetails ArticlePubMed
TargetCarbonic anhydrase 9(Homo sapiens (Human))
Salman Bin Abdulaziz University
Curated by ChEMBL
LigandPNGBDBM50428845(CHEMBL1594453)
Affinity DataKi:  33nM. Assay description: Inhibition of human carbonic anhydrase 9 preincubated for 15 mins by CO2 hydration stopped-flow assay
In DepthDetails ArticlePubMed
TargetCarbonic anhydrase 1(Homo sapiens (Human))
Salman Bin Abdulaziz University
Curated by ChEMBL
LigandPNGBDBM50428845(CHEMBL1594453)
Affinity DataKi:  71nM. Assay description: Inhibition of human carbonic anhydrase 1 preincubated for 15 mins by CO2 hydration stopped-flow assay
In DepthDetails ArticlePubMed