BDBM50428861 CHEMBL2338488
SMILES Clc1ccc(c(Cl)c1)S(=O)(=O)Nc1ccc(Oc2cncc(Cl)c2)cc1
InChI Key InChIKey=NDJHCHIRFDMKCN-UHFFFAOYSA-N
Data  1 IC50  1 EC50
  Tab Delimited (TSV)   2D SDfile   Computed 3D by Vconf -m prep SDfile
Find this compound or compounds like it in BindingDB:
Activity Spreadsheet -- Enzyme Inhibition Constant Data from BindingDB
Found 2 hits for monomerid = 50428861
TargetPeroxisome proliferator-activated receptor gamma(Homo sapiens (Human))
Amgen
Curated by ChEMBL
LigandPNGBDBM50428861(CHEMBL2338488)
Affinity DataEC50: >3.00E+4nM. Assay description: Transactivation of GAL4 DBD-fused human PPARgamma-LBD expressed in HEK293 cells after 24 hrs by luciferase reporter gene assay
In DepthDetails ArticlePubMed
TargetPeroxisome proliferator-activated receptor gamma(Homo sapiens (Human))
Amgen
Curated by ChEMBL
LigandPNGBDBM50428861(CHEMBL2338488)
Affinity DataIC50:  2.00E+3nM. Assay description: Displacement of [3H]-rosiglitazone from GST-tagged PPARgammaLBD (unknown origin) after 1 hr by scintillation proximity assay
In DepthDetails ArticlePubMed