BDBM50429471 CHEMBL2332834
SMILES [#7]-[#6]-[#6]-[#6]-[#6]-[#6@@H]-1-[#7]-[#6](=O)-[#6@H](-[#6]-[#6]-[#6]\[#7]=[#6](\[#7])-[#7])-[#7]-[#6](=O)-[#6]-[#7]-[#6](=O)-[#6]-[#6@H](-[#7]-[#6](=O)-[#6@H](-[#7]-[#6]-1=O)-c1ccccc1)-[#6](-[#8])=O
InChI Key InChIKey=LMCAPKVVZZHYLE-RYLXDESZSA-N
Data  5 IC50
  Tab Delimited (TSV)   2D SDfile   Computed 3D by Vconf -m prep SDfile
Find this compound or compounds like it in BindingDB:
Activity Spreadsheet -- Enzyme Inhibition Constant Data from BindingDB
Found 5 hits for monomerid = 50429471
TargetIntegrin alpha-IIb/beta-3(Homo sapiens (Human))
Technische Universit£T M£Nchen
Curated by ChEMBL
LigandPNGBDBM50429471(CHEMBL2332834)
Affinity DataIC50: >1.00E+4nM. Assay description: Inhibition of fibrinogen binding to Integrin alpha2bbeta3 receptor (unknown origin) by competitive ELISA
In DepthDetails ArticlePubMed
TargetIntegrin alpha-V/beta-6(Homo sapiens (Human))
Technische Universit£T M£Nchen
Curated by ChEMBL
LigandPNGBDBM50429471(CHEMBL2332834)
Affinity DataIC50:  140nM. Assay description: Inhibition of latency-associated peptide binding to Integrin alphaVbeta6 receptor (unknown origin) by competitive ELISA
In DepthDetails ArticlePubMed
TargetIntegrin alpha-5/beta-1(Homo sapiens (Human))
Technische Universit£T M£Nchen
Curated by ChEMBL
LigandPNGBDBM50429471(CHEMBL2332834)
Affinity DataIC50:  94nM. Assay description: Inhibition of fibronectin binding to human Integrin alpha5beta1 receptor by competitive ELISA
In DepthDetails ArticlePubMed
TargetIntegrin alpha-V/beta-3(Homo sapiens (Human))
Technische Universit£T M£Nchen
Curated by ChEMBL
LigandPNGBDBM50429471(CHEMBL2332834)
Affinity DataIC50:  516nM. Assay description: Inhibition of vitronectin binding to Integrin alphaVbeta3 receptor (unknown origin) by competitive ELISA
In DepthDetails ArticlePubMed
TargetIntegrin alpha-V/beta-5(Homo sapiens (Human))
Technische Universit£T M£Nchen
Curated by ChEMBL
LigandPNGBDBM50429471(CHEMBL2332834)
Affinity DataIC50: >1.00E+4nM. Assay description: Inhibition of vitronectin binding to Integrin alphaVbeta5 receptor (unknown origin) by competitive ELISA
In DepthDetails ArticlePubMed