BDBM50429553 CHEMBL2333361
SMILES FC(F)(F)c1cccc(Oc2ncccc2NC(=O)Nc2ccc(Cl)c(Cl)c2)c1
InChI Key InChIKey=BZJGTIZMKOQWMK-UHFFFAOYSA-N
Data  1 KI
  Tab Delimited (TSV)   2D SDfile   Computed 3D by Vconf -m prep SDfile
Find this compound or compounds like it in BindingDB:
Activity Spreadsheet -- Enzyme Inhibition Constant Data from BindingDB
Found 1 hit for monomerid = 50429553
TargetP2Y purinoceptor 1(Homo sapiens (Human))
Bristol-Myers Squibb Research And Development
Curated by ChEMBL
LigandPNGBDBM50429553(CHEMBL2333361)
Affinity DataKi:  84nM. Assay description: Displacement of [beta-33P]-2MeS-ADP from human P2Y1 receptor transfected in HEK293 cells assessed as residual [beta-33P] bound to plate after 1 hr by...
In DepthDetails ArticlePubMed