BDBM50429622 CHEMBL2334581
SMILES Nc1ncc2CCc3[nH]c4ccc(Cl)cc4c3-c2n1
InChI Key InChIKey=KAQABGOWPUBBDM-UHFFFAOYSA-N
Data  1 IC50
  Tab Delimited (TSV)   2D SDfile   Computed 3D by Vconf -m prep SDfile
Find this compound or compounds like it in BindingDB:
Activity Spreadsheet -- Enzyme Inhibition Constant Data from BindingDB
Found 1 hit for monomerid = 50429622
TargetMitogen-activated protein kinase kinase kinase 14(Homo sapiens (Human))
Amgen
Curated by ChEMBL
LigandPNGBDBM50429622(CHEMBL2334581)
Affinity DataIC50:  1.20E+3nM. Assay description: Inhibition of NIK (unknown origin) autophosphorylation after 1 hr by chemiluminescent assay
In DepthDetails ArticlePubMed