BDBM50429822 CHEMBL2337713::Sodium 3-(2-Carboxyvinyl)Benzoate
SMILES [O-]C(=O)\C=C\c1cccc(c1)C([O-])=O
InChI Key InChIKey=KLWPBEWWHJTYDC-SNAWJCMRSA-L
Data  1 KI  1 IC50
  Tab Delimited (TSV)   2D SDfile   Computed 3D by Vconf -m prep SDfile
Find this compound or compounds like it in BindingDB:
Activity Spreadsheet -- Enzyme Inhibition Constant Data from BindingDB
Found 2 hits for monomerid = 50429822
TargetChorismatase(Streptomyces hygroscopicus subsp. ascomyceticus)
University Of Freiburg
Curated by ChEMBL
LigandPNGBDBM50429822(CHEMBL2337713 | Sodium 3-(2-Carboxyvinyl)Benzoate)
Affinity DataKi:  1.96E+7nM. Assay description: Competitive inhibition of Streptomyces hygroscopicus subsp. ascomyceticus chorismatase FkbO expressed in Escherichia coli BL21(DE3) using chorismate ...
In DepthDetails ArticlePubMed
TargetChorismatase(Streptomyces hygroscopicus subsp. ascomyceticus)
University Of Freiburg
Curated by ChEMBL
LigandPNGBDBM50429822(CHEMBL2337713 | Sodium 3-(2-Carboxyvinyl)Benzoate)
Affinity DataIC50:  4.50E+7nM. Assay description: Inhibition of Streptomyces hygroscopicus subsp. ascomyceticus chorismatase FkbO expressed in Escherichia coli BL21(DE3) using chorismate as substrate...
In DepthDetails ArticlePubMed