BDBM50429936 CHEMBL2334244
SMILES OC(=O)CCCOc1ccccc1-c1cc(-c2ccccc2)n(n1)C1CCCCCC1
InChI Key InChIKey=NGLFZQRZNXSBMF-UHFFFAOYSA-N
Data  2 IC50
  Tab Delimited (TSV)   2D SDfile   Computed 3D by Vconf -m prep SDfile
Find this compound or compounds like it in BindingDB:
Activity Spreadsheet -- Enzyme Inhibition Constant Data from BindingDB
Found 2 hits for monomerid = 50429936
TargetFatty acid-binding protein, heart(Homo sapiens (Human))
Okayama University 1-1-1
Curated by ChEMBL
LigandPNGBDBM50429936(CHEMBL2334244)
Affinity DataIC50:  6.47E+3nM. Assay description: Inhibition of human FABP3 by 8-anilino-1-naphthalenesulfonic acid based fluorescence displacement assay
In DepthDetails ArticlePubMed
TargetFatty acid-binding protein, adipocyte(Homo sapiens (Human))
Okayama University 1-1-1
Curated by ChEMBL
LigandPNGBDBM50429936(CHEMBL2334244)
Affinity DataIC50:  1.55E+4nM. Assay description: Inhibition of human FABP4 by 8-anilino-1-naphthalenesulfonic acid based fluorescence displacement assay
In DepthDetails ArticlePubMed