BDBM50430180 CHEMBL2313089
SMILES Oc1ccc(Cl)cc1C(=O)Nc1ccc(Br)c(c1)C(F)(F)F
InChI Key InChIKey=RTMWXFHIEURUEK-UHFFFAOYSA-N
Data  1 IC50
  Tab Delimited (TSV)   2D SDfile   Computed 3D by Vconf -m prep SDfile
Find this compound or compounds like it in BindingDB:
Activity Spreadsheet -- Enzyme Inhibition Constant Data from BindingDB
Found 1 hit for monomerid = 50430180
TargetTransmembrane protease serine 4(Homo sapiens (Human))
Korea Research Institute Of Bioscience And Biotechnology
Curated by ChEMBL
LigandPNGBDBM50430180(CHEMBL2313089)
Affinity DataIC50:  3.00E+4nM. Assay description: Inhibition of N-terminal His6-tagged recombinant TMPRSS4 (unknown origin) fused with enterokinase cleavage sequence DYKDDDGDYKDDDDK expressed in Esch...
In DepthDetails ArticlePubMed