BDBM50430216 CHEMBL2331990
SMILES CC1=Nc2ccnn2[C@@H](C1c1ncnn1C1CCC1)c1ccc(Cl)c(Cl)c1
InChI Key InChIKey=UBGWXSYHQYIJPU-QRWMCTBCSA-N
Data  1 IC50
  Tab Delimited (TSV)   2D SDfile   Computed 3D by Vconf -m prep SDfile
Find this compound or compounds like it in BindingDB:
Activity Spreadsheet -- Enzyme Inhibition Constant Data from BindingDB
Found 1 hit for monomerid = 50430216
TargetPotassium voltage-gated channel subfamily A member 5(Homo sapiens (Human))
Bristol-Myers Squibb
Curated by ChEMBL
LigandPNGBDBM50430216(CHEMBL2331990)
Affinity DataIC50:  48nM. Assay description: Antagonist activity at human Kv1.5 expressed in mouse L929 cells assessed as inhibition of delayed rectifier repolarization current by patch clamp as...
In DepthDetails ArticlePubMed