BDBM50430455 CHEMBL2334711
SMILES O=C(C1CC1)N1CCC[C@H](C1)Nc1cc(ccn1)-n1c(nc2ccccc12)-c1ccc2ccccc2c1
InChI Key InChIKey=RTDQAEAZHTXYSM-RUZDIDTESA-N
Data  2 Kd
  Tab Delimited (TSV)   2D SDfile   Computed 3D by Vconf -m prep SDfile
Find this compound or compounds like it in BindingDB:
Activity Spreadsheet -- Enzyme Inhibition Constant Data from BindingDB
Found 2 hits for monomerid = 50430455
TargetMitogen-activated protein kinase 10(Homo sapiens (Human))
Hanyang University
Curated by ChEMBL
LigandPNGBDBM50430455(CHEMBL2334711)
Affinity DataKd:  1.07E+4nM. Assay description: Binding affinity to N-terminal His6X-tagged human recombinant JNK3 catalytic domain expressed in Escherichia coli BL21 (DE3) by surface plasmon reson...
In DepthDetails ArticlePubMed
TargetMitogen-activated protein kinase 10(Homo sapiens (Human))
Hanyang University
Curated by ChEMBL
LigandPNGBDBM50430455(CHEMBL2334711)
Affinity DataKd:  1.07E+4nM. Assay description: Binding affinity to JNK3 (unknown origin) by surface plasmon resonance analysis in presence of ATP
In DepthDetails ArticlePubMed