BDBM50430481 CHEMBL2335538
SMILES CCCCCCCCCSC1=CC(=O)c2ccccc2C1=O
InChI Key InChIKey=MDCOCLWREZNJHF-UHFFFAOYSA-N
Data  1 IC50
  Tab Delimited (TSV)   2D SDfile   Computed 3D by Vconf -m prep SDfile
Find this compound or compounds like it in BindingDB:
Activity Spreadsheet -- Enzyme Inhibition Constant Data from BindingDB
Found 1 hit for monomerid = 50430481
TargetSterol O-acyltransferase 1(Homo sapiens (Human))
Dongguk University-Seoul
Curated by ChEMBL
LigandPNGBDBM50430481(CHEMBL2335538)
Affinity DataIC50:  1.63E+3nM. Assay description: Inhibition of human macrophage ACAT expressed in human HepG2 cells using [14C]oleoyl-CoA as substrate incubated for 20 mins prior to substrate additi...
In DepthDetails ArticlePubMed