BDBM50430484 CHEMBL2335535
SMILES CCCCCCS(=O)c1cc(O)c2ccccc2c1
InChI Key InChIKey=LTKXPBUTVSFBMU-UHFFFAOYSA-N
Data  1 IC50
  Tab Delimited (TSV)   2D SDfile   Computed 3D by Vconf -m prep SDfile
Find this compound or compounds like it in BindingDB:
Activity Spreadsheet -- Enzyme Inhibition Constant Data from BindingDB
Found 1 hit for monomerid = 50430484
TargetSterol O-acyltransferase 1(Homo sapiens (Human))
Dongguk University-Seoul
Curated by ChEMBL
LigandPNGBDBM50430484(CHEMBL2335535)
Affinity DataIC50:  1.15E+4nM. Assay description: Inhibition of human macrophage ACAT expressed in human HepG2 cells using [14C]oleoyl-CoA as substrate incubated for 20 mins prior to substrate additi...
In DepthDetails ArticlePubMed