BDBM50430694 CHEMBL2333517
SMILES COc1ccc(COC(=O)C2C(NC(=O)N=C2C)c2ccco2)cc1OC
InChI Key InChIKey=XKEVFYBJHFXTIW-UHFFFAOYSA-N
Data  1 IC50
  Tab Delimited (TSV)   2D SDfile   Computed 3D by Vconf -m prep SDfile
Find this compound or compounds like it in BindingDB:
Activity Spreadsheet -- Enzyme Inhibition Constant Data from BindingDB
Found 1 hit for monomerid = 50430694
TargetSodium/iodide cotransporter(Rattus norvegicus)
Institut De Biologie Et De Technologies De Saclay (Ibitecs)
Curated by ChEMBL
LigandPNGBDBM50430694(CHEMBL2333517)
Affinity DataIC50:  400nM. Assay description: inhibition of sodium iodide symporter in rat FRTL5 cells after 1 hr by arsenic/cerium titration assay
In DepthDetails ArticlePubMed