BDBM50430730 CHEMBL2333926
SMILES C[C@H](Cc1ccc(OCCCCCCCCCCNc2c3CCCCc3nc3ccccc23)cc1)N(C)CC#C
InChI Key InChIKey=WQOUNYVRWYXXHY-GDLZYMKVSA-N
Data  4 IC50
  Tab Delimited (TSV)   2D SDfile   Computed 3D by Vconf -m prep SDfile
Find this compound or compounds like it in BindingDB:
Activity Spreadsheet -- Enzyme Inhibition Constant Data from BindingDB
Found 4 hits for monomerid = 50430730
TargetAmine oxidase [flavin-containing] B(Homo sapiens (Human))
Sun Yat-Sen University
Curated by ChEMBL
LigandPNGBDBM50430730(CHEMBL2333926)
Affinity DataIC50:  346nM. Assay description: Inhibition of recombinant human MAO-B using p-benzylamine substrate preincubated for 15 mins before substrate addition measured after 20 mins by fluo...
In DepthDetails ArticlePubMed
TargetAcetylcholinesterase(Electrophorus electricus (Electric eel))
Sun Yat-Sen University
Curated by ChEMBL
LigandPNGBDBM50430730(CHEMBL2333926)
Affinity DataIC50:  23nM. Assay description: Inhibition of electric eel AChE using acetylthiocholine chloride as substrate after 15 mins by Ellman's method
In DepthDetails ArticlePubMed
TargetCholinesterase(Equus caballus (Horse))
Sun Yat-Sen University
Curated by ChEMBL
LigandPNGBDBM50430730(CHEMBL2333926)
Affinity DataIC50:  2nM. Assay description: Inhibition of horse serum BChE using butylthiocholine chloride as substrate after 15 mins by Ellman's method
In DepthDetails ArticlePubMed
TargetAmine oxidase [flavin-containing] A(Homo sapiens (Human))
Sun Yat-Sen University
Curated by ChEMBL
LigandPNGBDBM50430730(CHEMBL2333926)
Affinity DataIC50:  313nM. Assay description: Inhibition of recombinant human MAO-A using p-tyramine substrate preincubated for 15 mins before substrate addition measured after 20 mins by fluores...
In DepthDetails ArticlePubMed