BDBM50430822 CHEMBL2335123
SMILES CCOc1ccccc1-c1ccc(cc1)-c1nc2ccc(F)cc2c(C(=O)NCCOCCN)c1C
InChI Key InChIKey=IDFZVKOWUHJMBY-UHFFFAOYSA-N
Data  1 IC50
  Tab Delimited (TSV)   2D SDfile   Computed 3D by Vconf -m prep SDfile
Find this compound or compounds like it in BindingDB:
Activity Spreadsheet -- Enzyme Inhibition Constant Data from BindingDB
Found 1 hit for monomerid = 50430822
TargetcAMP and cAMP-inhibited cGMP 3',5'-cyclic phosphodiesterase 10A(Homo sapiens (Human))
Astrazeneca
Curated by ChEMBL
LigandPNGBDBM50430822(CHEMBL2335123)
Affinity DataIC50:  991nM. Assay description: Inhibition of human PDE10A catalytic domain expressed in Escherichia coli BL21-Gold(DE3) by enzyme inhibition assay
In DepthDetails ArticlePubMed