BDBM50431005 CHEMBL2337884
SMILES CC[C@H](C)[C@H]1[C@@H](OC1=O)C(=O)N[C@H]1C[C@H]1C[C@H](NC(=O)CNC(=O)OCc1ccccc1)C=C
InChI Key InChIKey=WNJVSLFVOVJEPK-BZQRMLGDSA-N
Data  1 IC50
  Tab Delimited (TSV)   2D SDfile   Computed 3D by Vconf -m prep SDfile
Find this compound or compounds like it in BindingDB:
Activity Spreadsheet -- Enzyme Inhibition Constant Data from BindingDB
Found 1 hit for monomerid = 50431005
TargetProteasome subunit beta type-5(Homo sapiens (Human))
Hokkaido University
Curated by ChEMBL
LigandPNGBDBM50431005(CHEMBL2337884)
Affinity DataIC50:  41nM. Assay description: Inhibition of chymotrypsin-like activity of human 20S proteasome beta 5 subunit using Suc-LLVY-AMC as substrate after 60 mins by fluorescence assay
In DepthDetails ArticlePubMed