BDBM50431009 CHEMBL2338317
SMILES CC[C@H](C)[C@H]1[C@@H](OC1=O)C(=O)N[C@H]1C[C@H]1C[C@@H](CCc1ccc2ccccc2c1)NC(=O)[C@H](C)NC(=O)OCc1ccccc1
InChI Key InChIKey=YGQIHDKDLUVJLR-LMQNEDHMSA-N
Data  1 IC50
  Tab Delimited (TSV)   2D SDfile   Computed 3D by Vconf -m prep SDfile
Find this compound or compounds like it in BindingDB:
Activity Spreadsheet -- Enzyme Inhibition Constant Data from BindingDB
Found 1 hit for monomerid = 50431009
TargetProteasome subunit beta type-5(Homo sapiens (Human))
Hokkaido University
Curated by ChEMBL
LigandPNGBDBM50431009(CHEMBL2338317)
Affinity DataIC50:  29nM. Assay description: Inhibition of chymotrypsin-like activity of human 20S proteasome beta 5 subunit using Suc-LLVY-AMC as substrate after 60 mins by fluorescence assay
In DepthDetails ArticlePubMed