BDBM50431058 CHEMBL2338768
SMILES Clc1ccc(Oc2ccc3N[C@H](C4CCCCC4)[C@@H]4CCCO[C@@H]4c3c2)cc1Cl
InChI Key InChIKey=RVVBFSLHYPTUOP-GLYQVZKVSA-N
Data  1 KI
  Tab Delimited (TSV)   2D SDfile   Computed 3D by Vconf -m prep SDfile
Find this compound or compounds like it in BindingDB:
Activity Spreadsheet -- Enzyme Inhibition Constant Data from BindingDB
Found 1 hit for monomerid = 50431058
TargetSigma non-opioid intracellular receptor 1(Homo sapiens (Human))
Esteve
Curated by ChEMBL
LigandPNGBDBM50431058(CHEMBL2338768)
Affinity DataKi:  79nM. Assay description: Displacement of [3H]-(+)-pentazocine from human sigma1 receptor transfected in HEK293 cells after 120 mins by liquid scintillation counting analysis
In DepthDetails ArticlePubMed