BDBM50431232 CHEMBL2332622
SMILES CC[C@@H](NC(=O)c1ccnc2ccccc12)C(=O)N1CCC[C@H]1B(O)O
InChI Key InChIKey=DDSNGWWAXQJNCU-ZBFHGGJFSA-N
Data  2 IC50
  Tab Delimited (TSV)   2D SDfile   Computed 3D by Vconf -m prep SDfile
Find this compound or compounds like it in BindingDB:
Activity Spreadsheet -- Enzyme Inhibition Constant Data from BindingDB
Found 2 hits for monomerid = 50431232
TargetProlyl endopeptidase FAP(Homo sapiens (Human))
Tufts University Sackler School Of Biomedical Sciences
Curated by ChEMBL
LigandPNGBDBM50431232(CHEMBL2332622)
Affinity DataIC50:  65nM. Assay description: Inhibition of human FAP using Z-Gly-Pro-AMC as substrate preincubated for 10 mins prior to substrate addition by fluorescence assay
In DepthDetails ArticlePubMed
TargetProlyl endopeptidase(Homo sapiens (Human))
Tufts University Sackler School Of Biomedical Sciences
Curated by ChEMBL
LigandPNGBDBM50431232(CHEMBL2332622)
Affinity DataIC50:  96nM. Assay description: Inhibition of human PREP using Z-Gly-Pro-AMC as substrate preincubated for 10 mins prior to substrate addition by fluorescence assay
In DepthDetails ArticlePubMed