BDBM50431314 CHEMBL2349207
SMILES CCC(N1C(=S)S\C(=C/c2ccc(o2)-c2ccc(Br)cc2)C1=O)C(O)=O
InChI Key InChIKey=XCTMUWMKPHBVIO-DHDCSXOGSA-N
Data  1 IC50
  Tab Delimited (TSV)   2D SDfile   Computed 3D by Vconf -m prep SDfile
Find this compound or compounds like it in BindingDB:
Activity Spreadsheet -- Enzyme Inhibition Constant Data from BindingDB
Found 1 hit for monomerid = 50431314
TargetMitogen-activated protein kinase kinase kinase 5(Homo sapiens (Human))
Nas Of Ukraine
Curated by ChEMBL
LigandPNGBDBM50431314(CHEMBL2349207)
Affinity DataIC50:  500nM. Assay description: Inhibition of human ASK1 using MBP as substrate incubated for 10 mins prior to ATP addition measured after 20 mins by liquid scintillation counting a...
In DepthDetails ArticlePubMed