BDBM50431316 CHEMBL2349220
SMILES COC(=O)CCCN1C(=S)S\C(=C/c2ccc(o2)-c2ccc(Br)cc2)C1=O
InChI Key InChIKey=ZWFXJAXGWFJFCG-WJDWOHSUSA-N
Data  1 IC50
  Tab Delimited (TSV)   2D SDfile   Computed 3D by Vconf -m prep SDfile
Find this compound or compounds like it in BindingDB:
Activity Spreadsheet -- Enzyme Inhibition Constant Data from BindingDB
Found 1 hit for monomerid = 50431316
TargetMitogen-activated protein kinase kinase kinase 5(Homo sapiens (Human))
Nas Of Ukraine
Curated by ChEMBL
LigandPNGBDBM50431316(CHEMBL2349220)
Affinity DataIC50: >3.30E+4nM. Assay description: Inhibition of human ASK1 using MBP as substrate incubated for 10 mins prior to ATP addition measured after 20 mins by liquid scintillation counting a...
In DepthDetails ArticlePubMed