BDBM50431333 CHEMBL2347231
SMILES NC(=O)Nc1ccc2ncnc(Nc3ccc(Cl)cc3)c2c1
InChI Key InChIKey=YDZATYFCHVJGEI-UHFFFAOYSA-N
Data  1 IC50
  Tab Delimited (TSV)   2D SDfile   Computed 3D by Vconf -m prep SDfile
Find this compound or compounds like it in BindingDB:
Activity Spreadsheet -- Enzyme Inhibition Constant Data from BindingDB
Found 1 hit for monomerid = 50431333
TargetEpidermal growth factor receptor(Homo sapiens (Human))
Misr International University
Curated by ChEMBL
LigandPNGBDBM50431333(CHEMBL2347231)
Affinity DataIC50:  61nM. Assay description: Inhibition of EGFR tyrosine kinase (unknown origin) using poly (Glu,Tyr) as substrate after 30 mins by ADP-GloTM assay
In DepthDetails ArticlePubMed