BDBM50431347 CHEMBL2348650
SMILES CNc1nc(C)c(s1)-c1nc(Nc2cccc(c2)N2CCCNCC2)ncc1F
InChI Key InChIKey=ZHXQLMCSTVATST-UHFFFAOYSA-N
Data  4 KI
  Tab Delimited (TSV)   2D SDfile   Computed 3D by Vconf -m prep SDfile
Find this compound or compounds like it in BindingDB:
Activity Spreadsheet -- Enzyme Inhibition Constant Data from BindingDB
Found 4 hits for monomerid = 50431347
TargetCyclin-T1/Cyclin-dependent kinase 9(Homo sapiens (Human))
University Of Nottingham
Curated by ChEMBL
LigandPNGBDBM50431347(CHEMBL2348650)
Affinity DataKi:  5nM. Assay description: Inhibition of human recombinant His6 tagged CDK9/CyclinT1 expressed in Sf21 insect cells after 40 mins by scintillation counting analysis
In DepthDetails ArticlePubMed
TargetCyclin-dependent kinase/G2/mitotic-specific cyclin- 1(Homo sapiens (Human))
University Of Nottingham
Curated by ChEMBL
LigandPNGBDBM50431347(CHEMBL2348650)
Affinity DataKi:  47nM. Assay description: Inhibition of human recombinant His6 tagged CDK1/Cyclin B expressed in Sf21 insect cells after 40 mins by scintillation counting analysis
In DepthDetails ArticlePubMed
TargetCyclin-A1/Cyclin-A2/Cyclin-dependent kinase 2(Homo sapiens (Human))
University Of Nottingham
Curated by ChEMBL
LigandPNGBDBM50431347(CHEMBL2348650)
Affinity DataKi:  85nM. Assay description: Inhibition of human recombinant His6 tagged CDK2/Cyclin A expressed in Sf21 insect cells after 40 mins by scintillation counting analysis
In DepthDetails ArticlePubMed
TargetCyclin-H/Cyclin-dependent kinase 7(Homo sapiens (Human))
University Of Nottingham
Curated by ChEMBL
LigandPNGBDBM50431347(CHEMBL2348650)
Affinity DataKi:  111nM. Assay description: Inhibition of human recombinant His6 tagged CDK7/CyclinH/MAT1 expressed in Sf21 insect cells after 40 mins by scintillation counting analysis
In DepthDetails ArticlePubMed