BDBM50431364 CHEMBL2348640
SMILES CCCc1cnc(Nc2cccc(c2)S(N)(=O)=O)nc1-c1sc(NC)nc1C
InChI Key InChIKey=METVKPPIUTYYDQ-UHFFFAOYSA-N
Data  2 KI
  Tab Delimited (TSV)   2D SDfile   Computed 3D by Vconf -m prep SDfile
Find this compound or compounds like it in BindingDB:
Activity Spreadsheet -- Enzyme Inhibition Constant Data from BindingDB
Found 2 hits for monomerid = 50431364
TargetCyclin-T1/Cyclin-dependent kinase 9(Homo sapiens (Human))
University Of Nottingham
Curated by ChEMBL
LigandPNGBDBM50431364(CHEMBL2348640)
Affinity DataKi: >5.00E+3nM. Assay description: Inhibition of human recombinant His6 tagged CDK9/CyclinT1 expressed in Sf21 insect cells after 40 mins by scintillation counting analysis
In DepthDetails ArticlePubMed
TargetCyclin-A1/Cyclin-A2/Cyclin-dependent kinase 2(Homo sapiens (Human))
University Of Nottingham
Curated by ChEMBL
LigandPNGBDBM50431364(CHEMBL2348640)
Affinity DataKi: >5.00E+3nM. Assay description: Inhibition of human recombinant His6 tagged CDK2/Cyclin A expressed in Sf21 insect cells after 40 mins by scintillation counting analysis
In DepthDetails ArticlePubMed