BDBM50431443 CHEMBL2348283
SMILES CCOCCNC(=O)CCc1cc(I)c(Oc2ccc(O)cc2)c(I)c1
InChI Key InChIKey=PECDGNVEDBZABJ-UHFFFAOYSA-N
Data  1 IC50
  Tab Delimited (TSV)   2D SDfile   Computed 3D by Vconf -m prep SDfile
Find this compound or compounds like it in BindingDB:
Activity Spreadsheet -- Enzyme Inhibition Constant Data from BindingDB
Found 1 hit for monomerid = 50431443
TargetProliferating cell nuclear antigen(Homo sapiens (Human))
St. Jude Children'S Research Hospital
Curated by ChEMBL
LigandPNGBDBM50431443(CHEMBL2348283)
Affinity DataIC50:  6.50E+3nM. Assay description: Inhibition of human recombinant PCNA interaction with PIP box protein N-5-carboxyfluorescein-SAVLQKKITDYFHPKK after 30 mins by fluorescence polarizat...
In DepthDetails ArticlePubMed