BDBM50431492 CHEMBL2348671
SMILES Fc1ccccc1NC(C(=O)N1CCCC1c1cccnc1)c1ccc(cc1)C(F)(F)F
InChI Key InChIKey=AVVFFRHSJVMZKQ-UHFFFAOYSA-N
Data  1 IC50
  Tab Delimited (TSV)   2D SDfile   Computed 3D by Vconf -m prep SDfile
Find this compound or compounds like it in BindingDB:
Activity Spreadsheet -- Enzyme Inhibition Constant Data from BindingDB
Found 1 hit for monomerid = 50431492
TargetTransient receptor potential M8 protein(Canis lupus familiaris (Dog))
Janssen Research And Development
Curated by ChEMBL
LigandPNGBDBM50431492(CHEMBL2348671)
Affinity DataIC50:  7nM. Assay description: Antagonist activity at dog TRPM8 expressed in HEK293 cells assessed as inhibition of icilin-induced calcium influx incubated for 5 mins prior to icil...
In DepthDetails ArticlePubMed