BDBM50431630 KRX-0401::PERIFOSINE
SMILES CCCCCCCCCCCCCCCCCCOP([O-])(=O)OC1CC[N+](C)(C)CC1
InChI Key InChIKey=SZFPYBIJACMNJV-UHFFFAOYSA-N
Data  4 IC50
  Tab Delimited (TSV)   2D SDfile   Computed 3D by Vconf -m prep SDfile
Find this compound or compounds like it in BindingDB:
Activity Spreadsheet -- Enzyme Inhibition Constant Data from BindingDB
Found 4 hits for monomerid = 50431630
TargetRAC-alpha serine/threonine-protein kinase(Homo sapiens (Human))
University Of Milano-Bicocca
Curated by ChEMBL
LigandPNGBDBM50431630(KRX-0401 | PERIFOSINE)
Affinity DataIC50:  4.34E+4nM. Assay description: Inhibition of human Akt1 PH domain using AKTide-2T as substrate by ELISA
In DepthDetails ArticlePubMed
TargetUbiquitin carboxyl-terminal hydrolase isozyme L3(Homo sapiens (Human))
University Of Science And Technology
Curated by ChEMBL
LigandPNGBDBM50431630(KRX-0401 | PERIFOSINE)
Affinity DataIC50:  50nM. Assay description: Inhibition of UCHL3 (unknown origin) assessed as reduction in RAD51 deubiquitination incubated for 4 hrs
In DepthDetails PubMed
TargetMitogen-activated protein kinase 14(Homo sapiens (Human))
University Of California
Curated by ChEMBL
LigandPNGBDBM50431630(KRX-0401 | PERIFOSINE)
Affinity DataIC50:  1.20E+3nM. Assay description: Inhibition of wild-type human P38alpha MAPK expressed in Escherichia coli Rosetta cells
In DepthDetails ArticlePubMed
TargetRAC-alpha serine/threonine-protein kinase(Homo sapiens (Human))
University Of Milano-Bicocca
Curated by ChEMBL
LigandPNGBDBM50431630(KRX-0401 | PERIFOSINE)
Affinity DataIC50:  5.30E+3nM. Assay description: Inhibition of Akt phosphorylation in human insulin-stimulated A549 cells incubated for 2 hrs prior to insulin-induction measured after 30 mins by ELI...
In DepthDetails ArticlePubMed