BDBM50431756 CHEMBL2346885
SMILES O=C(Nc1nccs1)[C@H](CC1CCCC1)n1cnc2cc(ccc2c1=O)S(=O)(=O)C1CC1
InChI Key InChIKey=RXQBAWPOTDTXRL-IBGZPJMESA-N
Data  1 EC50
  Tab Delimited (TSV)   2D SDfile   Computed 3D by Vconf -m prep SDfile
Find this compound or compounds like it in BindingDB:
Activity Spreadsheet -- Enzyme Inhibition Constant Data from BindingDB
Found 1 hit for monomerid = 50431756
TargetHexokinase-4(Homo sapiens (Human))
Takeda California
Curated by ChEMBL
LigandPNGBDBM50431756(CHEMBL2346885)
Affinity DataEC50:  2.00E+3nM. Assay description: Activation of glucokinase (unknown origin)
In DepthDetails ArticlePubMed