BDBM50431767 CHEMBL2346897
SMILES CS(=O)(=O)c1ccc2c(c1)ncn([C@@H](CC1CCCCC1)C(=O)Nc1nccs1)c2=O
InChI Key InChIKey=MOLZLBZIBIWKJC-SFHVURJKSA-N
Data  1 EC50
  Tab Delimited (TSV)   2D SDfile   Computed 3D by Vconf -m prep SDfile
Find this compound or compounds like it in BindingDB:
Activity Spreadsheet -- Enzyme Inhibition Constant Data from BindingDB
Found 1 hit for monomerid = 50431767
TargetHexokinase-4(Homo sapiens (Human))
Takeda California
Curated by ChEMBL
LigandPNGBDBM50431767(CHEMBL2346897)
Affinity DataEC50:  500nM. Assay description: Activation of glucokinase (unknown origin)
In DepthDetails ArticlePubMed