BDBM50431982 CHEMBL2348521
SMILES CN1CC[C@@H](C1)Oc1cc(NCc2cccs2)ccc1C(F)(F)F
InChI Key InChIKey=YNHVGRQTPLHKSW-ZDUSSCGKSA-N
Data  2 IC50
  Tab Delimited (TSV)   2D SDfile   Computed 3D by Vconf -m prep SDfile
Find this compound or compounds like it in BindingDB:
Activity Spreadsheet -- Enzyme Inhibition Constant Data from BindingDB
Found 2 hits for monomerid = 50431982
TargetUrotensin-2 receptor(Homo sapiens (Human))
Boehringer Ingelheim Pharmaceuticals
Curated by ChEMBL
LigandPNGBDBM50431982(CHEMBL2348521)
Affinity DataIC50:  2.70E+3nM. Assay description: Displacement of [125I]-U2 from human recombinant urotensin2 receptor expressed in human Chem-2 cells after 4 hrs by scintillation proximity assay
In DepthDetails ArticlePubMed
TargetUrotensin-2 receptor(Homo sapiens (Human))
Boehringer Ingelheim Pharmaceuticals
Curated by ChEMBL
LigandPNGBDBM50431982(CHEMBL2348521)
Affinity DataIC50:  2.00E+3nM. Assay description: Antagonist activity at recombinant human urotensin2 receptor expressed in CHO cells assessed as inhibition of urotensin2-stimulated Ca2+ mobilization...
In DepthDetails ArticlePubMed