BDBM50431988 CHEMBL2348526
SMILES COc1cc(Br)c(cc1OC)S(=O)(=O)Nc1ccc(c(OCCN2CCOCC2)c1)C(F)(F)F
InChI Key InChIKey=ODXBMOBSHUFPEA-UHFFFAOYSA-N
Data  1 IC50
  Tab Delimited (TSV)   2D SDfile   Computed 3D by Vconf -m prep SDfile
Find this compound or compounds like it in BindingDB:
Activity Spreadsheet -- Enzyme Inhibition Constant Data from BindingDB
Found 1 hit for monomerid = 50431988
TargetUrotensin-2 receptor(Homo sapiens (Human))
Boehringer Ingelheim Pharmaceuticals
Curated by ChEMBL
LigandPNGBDBM50431988(CHEMBL2348526)
Affinity DataIC50:  6.20E+3nM. Assay description: Displacement of [125I]-U2 from human recombinant urotensin2 receptor expressed in human Chem-2 cells after 4 hrs by scintillation proximity assay
In DepthDetails ArticlePubMed