BDBM50432042 CHEMBL2348966
SMILES CC(C)(C)c1cccc(Sc2ccc3nnc(-c4cncs4)n3n2)c1
InChI Key InChIKey=KGNXSPBPKNCZMW-UHFFFAOYSA-N
Data  1 IC50
  Tab Delimited (TSV)   2D SDfile   Computed 3D by Vconf -m prep SDfile
Find this compound or compounds like it in BindingDB:
Activity Spreadsheet -- Enzyme Inhibition Constant Data from BindingDB
Found 1 hit for monomerid = 50432042
TargetLeucine-rich repeat serine/threonine-protein kinase 2(Homo sapiens (Human))
Elan Pharmaceuticals
Curated by ChEMBL
LigandPNGBDBM50432042(CHEMBL2348966)
Affinity DataIC50:  75nM. Assay description: Inhibition of wild type LRRK2 (unknown origin) by TR-FRET assay
In DepthDetails ArticlePubMed