BDBM50432101 CHEMBL2349571
SMILES COc1nc(C)c(Nc2nc(C)cn([C@@H](CF)C3CC3)c2=O)cc1C
InChI Key InChIKey=RAFFGFKAAUYWOU-HNNXBMFYSA-N
Data  1 IC50
  Tab Delimited (TSV)   2D SDfile   Computed 3D by Vconf -m prep SDfile
Find this compound or compounds like it in BindingDB:
Activity Spreadsheet -- Enzyme Inhibition Constant Data from BindingDB
Found 1 hit for monomerid = 50432101
TargetCorticotropin-releasing factor receptor 1(Rattus norvegicus (rat))
Bristol-Myers Squibb Research And Development
Curated by ChEMBL
LigandPNGBDBM50432101(CHEMBL2349571)
Affinity DataIC50:  4.70nM. Assay description: Displacement of [125I]-o-CRF from CRF1 receptor in rat frontal cortex homogenate after 2 hrs by gamma counting
In DepthDetails ArticlePubMed