BDBM50432104 CHEMBL2349568
SMILES FCCOC[C@@H](C1CC1)n1cc(Cl)nc(Nc2cc(F)c(cc2F)C#N)c1=O
InChI Key InChIKey=XCSQOVYCOUHVDR-HNNXBMFYSA-N
Data  1 IC50
  Tab Delimited (TSV)   2D SDfile   Computed 3D by Vconf -m prep SDfile
Find this compound or compounds like it in BindingDB:
Activity Spreadsheet -- Enzyme Inhibition Constant Data from BindingDB
Found 1 hit for monomerid = 50432104
TargetCorticotropin-releasing factor receptor 1(Rattus norvegicus (rat))
Bristol-Myers Squibb Research And Development
Curated by ChEMBL
LigandPNGBDBM50432104(CHEMBL2349568)
Affinity DataIC50: >1.00E+3nM. Assay description: Displacement of [125I]-o-CRF from CRF1 receptor in rat frontal cortex homogenate after 2 hrs by gamma counting
In DepthDetails ArticlePubMed