BDBM50432109 CHEMBL2349563
SMILES COc1nc(Cl)nc(C)c1Nc1nc(Br)cn([C@@H](COCCF)C2CC2)c1=O
InChI Key InChIKey=TZLPACCLUOKXCP-NSHDSACASA-N
Data  1 IC50
  Tab Delimited (TSV)   2D SDfile   Computed 3D by Vconf -m prep SDfile
Find this compound or compounds like it in BindingDB:
Activity Spreadsheet -- Enzyme Inhibition Constant Data from BindingDB
Found 1 hit for monomerid = 50432109
TargetCorticotropin-releasing factor receptor 1(Rattus norvegicus (rat))
Bristol-Myers Squibb Research And Development
Curated by ChEMBL
LigandPNGBDBM50432109(CHEMBL2349563)
Affinity DataIC50:  14nM. Assay description: Displacement of [125I]-o-CRF from CRF1 receptor in rat frontal cortex homogenate after 2 hrs by gamma counting
In DepthDetails ArticlePubMed