BDBM50432580 CHEMBL2347032
SMILES NCCCCc1c[nH]c2c(F)cccc12
InChI Key InChIKey=CODMIIYHWPZIMY-UHFFFAOYSA-N
Data  1 KI  2 IC50
  Tab Delimited (TSV)   2D SDfile   Computed 3D by Vconf -m prep SDfile
Find this compound or compounds like it in BindingDB:
Activity Spreadsheet -- Enzyme Inhibition Constant Data from BindingDB
Found 3 hits for monomerid = 50432580
TargetSodium-dependent serotonin transporter(Homo sapiens (Human))
Universit£
Curated by ChEMBL
LigandPNGBDBM50432580(CHEMBL2347032)
Affinity DataKi:  8nM. Assay description: Inhibition of serotonin reuptake at human SERT expressed in HEK293 cells coexpressing macrophage scavenger receptor
In DepthDetails ArticlePubMed
TargetMyeloperoxidase(Homo sapiens (Human))
Universit£
Curated by ChEMBL
LigandPNGBDBM50432580(CHEMBL2347032)
Affinity DataIC50:  6nM. Assay description: Inhibition of human recombinant MPO-mediated taurine chlorination after 5 mins by microplate assay
In DepthDetails ArticlePubMed
TargetMyeloperoxidase(Homo sapiens (Human))
Universit£
Curated by ChEMBL
LigandPNGBDBM50432580(CHEMBL2347032)
Affinity DataIC50:  21nM. Assay description: Inhibition of human recombinant MPO-mediated LDL oxidation after 5 mins by ELISA
In DepthDetails ArticlePubMed